{"text_format":"1","workbook":"xlsx","n_sheets":6,"sheets":["はじめに","入学志願票（個別の入学資格審査用）","「志願先」欄  選択一覧","「志願先」欄 選択一覧（検索用）","「受験科目」欄 選択一覧（編集用）","「受験科目」欄 選択一覧（検索用）"],"not_rendered":{"charts":0,"images":0,"macros":1,"external_links":0,"defined_names":4,"comments":0,"pivot_tables":0},"unopened":[],"bounds":{"document_bytes":16777216,"sheet_cells":100000,"rows_first":2000,"rows_last":500,"rows_between":2000,"halvings":0,"cell_chars":16384,"cell_head_chars":4096},"cells_cut":0,"cells_raw":0,"read":"whole","date_system":"1900"}

{"sheet":"はじめに","index":0,"n_rows":10,"n_cols":2,"rows_kept":10,"cut":false,"hidden":false,"merged":[]}
["「入学志願票（個別の入学資格審査用）」の作成について"]
[]
["◆","この様式は「個別の入学資格審査」時の書類提出の際にのみ全専攻共通で使用します。"]
[null,"資格審査許可後の通常の出願手続きの際には使用できません。"]
[]
["◆","その他の必要書類は審査を希望する専攻によって異なります。"]
[null,"入試要項を確認のうえ必要書類を用意してください。"]
[]
["◆","個別の入学資格審査に関する詳細は入試要項をご覧ください。"]
[null,"https://saas.actibookone.com/content/detail?param=eyJjb250ZW50TnVtIjoxMTYwNzB9&detailFlg=0&pNo=238"]

{"sheet":"入学志願票（個別の入学資格審査用）","index":1,"n_rows":81,"n_cols":33,"rows_kept":81,"cut":false,"hidden":false,"merged":[[80,0,80,3],[80,4,80,18],[2,1,2,2],[2,3,2,4],[2,5,2,6],[2,7,2,10],[2,11,2,12],[2,13,2,15],[3,1,3,2],[76,1,76,2],[76,6,77,18],[77,1,77,2],[77,4,77,5],[78,1,79,3],[78,4,79,18],[72,1,72,2],[72,6,73,18],[73,1,73,2],[74,1,74,2],[74,6,75,18],[75,1,75,2],[66,6,67,18],[67,1,67,2],[68,1,68,2],[68,6,69,18],[69,1,69,2],[70,1,70,2],[70,6,71,18],[71,1,71,2],[61,0,79,0],[61,1,61,5],[61,6,61,18],[62,1,62,2],[62,6,63,18],[63,1,63,2],[64,1,64,2],[64,6,65,18],[65,1,65,2],[66,1,66,2],[58,0,58,1],[58,2,58,18],[59,0,60,0],[59,1,59,2],[59,3,59,9],[59,10,59,11],[59,12,59,18],[60,1,60,2],[60,3,60,18],[51,2,55,2],[56,0,56,18],[57,0,57,18],[48,0,48,1],[48,10,48,11],[48,2,48,3],[48,4,48,9],[48,12,48,18],[49,0,49,6],[49,7,49,18],[50,0,55,1],[50,3,50,18],[51,3,55,18],[46,0,46,1],[46,5,46,7],[46,8,46,11],[46,12,46,18],[47,0,47,1],[47,5,47,7],[47,8,47,11],[47,12,47,18],[42,0,42,6],[42,7,42,18],[43,0,43,6],[43,7,43,18],[44,0,44,18],[45,0,45,4],[45,5,45,7],[45,8,45,11],[45,12,45,18],[40,0,41,2],[40,3,41,11],[40,12,40,13],[40,17,40,18],[41,12,41,13],[41,17,41,18],[38,0,39,2],[38,3,39,11],[38,12,38,13],[38,17,38,18],[39,12,39,13],[39,17,39,18],[36,0,37,2],[36,3,37,11],[36,12,36,13],[36,17,36,18],[37,12,37,13],[37,17,37,18],[34,0,35,2],[34,3,35,11],[34,12,34,13],[34,17,34,18],[35,12,35,13],[35,17,35,18],[32,0,33,2],[32,3,33,11],[32,12,32,13],[32,17,32,18],[33,12,33,13],[33,17,33,18],[30,0,31,2],[30,3,31,11],[30,12,30,13],[30,17,30,18],[31,12,31,13],[31,17,31,18],[28,0,29,2],[28,3,29,11],[28,12,28,13],[28,17,28,18],[29,12,29,13],[29,17,29,18],[26,0,27,2],[26,3,27,11],[26,12,26,13],[26,17,26,18],[27,12,27,13],[27,17,27,18],[24,0,25,2],[24,3,25,11],[24,12,24,13],[24,17,24,18],[25,12,25,13],[25,17,25,18],[22,0,23,2],[22,3,23,11],[22,12,22,13],[22,17,22,18],[23,12,23,13],[23,17,23,18],[20,0,21,2],[20,3,21,11],[20,12,20,13],[20,17,20,18],[21,12,21,13],[21,17,21,18],[18,0,19,2],[18,3,19,11],[18,12,18,13],[18,17,18,18],[19,12,19,13],[19,17,19,18],[16,0,17,2],[16,3,17,11],[16,12,16,13],[16,17,16,18],[17,12,17,13],[17,17,17,18],[14,0,15,2],[14,3,15,11],[14,12,14,13],[14,17,14,18],[15,12,15,13],[15,17,15,18],[0,20,1,31],[0,32,1,61],[11,3,11,4],[11,10,11,13],[12,0,12,18],[13,0,13,2],[13,3,13,11],[13,12,13,18],[9,1,9,3],[9,4,9,9],[9,10,9,15],[10,1,10,3],[10,4,10,9],[10,10,10,15],[10,16,11,16],[10,17,11,18],[11,0,11,2],[7,1,7,3],[7,4,7,9],[7,10,7,15],[8,1,8,3],[8,4,8,9],[8,10,8,15],[6,14,6,17],[6,7,6,10],[2,0,4,0],[5,0,6,6],[0,0,0,11],[0,12,0,13],[0,14,0,18],[1,0,1,18],[7,0,10,0],[3,3,3,7],[3,8,3,10],[3,11,3,15],[4,11,4,15],[4,1,4,10],[5,7,5,10],[5,11,5,18],[6,11,6,12],[7,16,9,16],[7,17,9,18]]}
["2027年度法政大学大学院",null,null,null,null,null,null,null,null,null,null,null,null,null,null,null,null,null,null,null,"＜入力に関する注意事項＞",null,null,null,null,null,null,null,null,null,null,null,"※このExcelファイルにはマクロが使用されています。\n  「マクロを有効にする」もしくは「コンテンツの有効化」ボタン等を押して作成を開始してください。"]
["入学志願票（個別の入学資格審査用）"]
["志願先","①課程",null,null,null,"②研究科",null,null,null,null,null,"③専攻",null,null,null,null,null,null,null,null,null,"◆「志願先」欄の入力  ※①〜⑥を順番に全て入力してください。"]
[null,"④入試経路",null,null,null,null,null,null,{"$f":"IFERROR(IF(VLOOKUP(D3&H3&N3&D4,'「志願先」欄 選択一覧（検索用）'!$P:$Q,2,0)=\"なし\",\"⑤その他選択：なし\",\"⑤その他選択\"),\"⑤その他選択\")","v":"⑤その他選択"},null,null,null,null,null,null,null,null,null,null,null,null,null,"・",{"$f":"IF(X5<>\"\",\"以下が未入力です。\",\"入力OK\")","v":"以下が未入力です。"}]
[null,{"$f":"IFERROR(\n  IF(VLOOKUP(D3&H3&N3&D4,'「志願先」欄 選択一覧（検索用）'!P:R,3,0)=\"併願可\",\n       \"⑥修士課程と研修生の併願\",\n  IF(OR(VLOOKUP(D3&H3&N3&D4,'「志願先」欄 選択一覧（検索用）'!P:R,3,0)=\"併願不可\",VLOOKUP(D3&H3&N3&D4,'「志願先」欄 選択一覧（検索用）'!P:R,3,0)=\"該当なし\"),\n       \"⑥この志願先は修士課程と研修生の併願制度はありません\",\"\")),\n  \"⑥修士課程と研修生の併願\")","v":"⑥修士課程と研修生の併願"},null,null,null,null,null,null,null,null,null,null,null,null,null,null,null,null,null,null,null,null,null,{"$f":"IF(D3=\"\",\"①課程：入力欄右下の「▼」マークをクリックして、受験する課程を選択してください。\",\nIF(AND(D3<>\"\",H3=\"\"),\n     \"②研究科：入力欄右下の「▼」マークをクリックして、受験する研究科を選択してください。\",\nIF(AND(D3<>\"\",H3<>\"\",N3=\"\"),\n     \"③専攻：入力欄右下の「▼」マークをクリックして、受験する専攻を選択してください。\",\nIF(AND(D3<>\"\",H3<>\"\",N3<>\"\",D4=\"\"),\n     \"④入試経路：入力欄右下の「▼」マークをクリックして、受験する入試経路を選択してください。\",\nIF(AND(D3<>\"\",H3<>\"\",N3<>\"\",D4<>\"\",L4=\"\",I4=\"⑤その他選択\"),\n     \"⑤その他選択：入力欄右下の「▼」マークをクリックして、必要事項を選択してください。\",\nIF(AND(D3<>\"\",H3<>\"\",N3<>\"\",D4<>\"\",OR(L4<>\"\",AND(L4=\"\",I4=\"⑤その他選択：なし\")),L5=\"\",B5=\"⑥修士課程と研修生の併願\"),\n     \"⑥修士課程と研修生の併願：入力欄右下の「▼」マークをクリックして、修士課程と研修生との併願有無を選択してください。\",\nIF(AND(D3<>\"\",H3<>\"\",N3<>\"\",D4<>\"\",OR(L4<>\"\",AND(L4=\"\",I4=\"⑤その他選択：なし\")),L5<>\"\",B5=\"⑥修士課程と研修生の併願\"),\n     \"\",\nIF(AND(D3<>\"\",H3<>\"\",N3<>\"\",D4<>\"\",OR(L4<>\"\",AND(L4=\"\",I4=\"⑤その他選択：なし\")),L5=\"\",B5=\"⑥この志願先は修士課程と研修生の併願制度はありません\"),\n     \"\",\n))))))))","v":"①課程：入力欄右下の「▼」マークをクリックして、受験する課程を選択してください。"}]
["過去の本学大学院での\n個別の入学資格審査有無\n（直近のもの）",null,null,null,null,null,null,"審査有無"]
[null,null,null,null,null,null,null,"審査年度・専攻",null,null,null,null,null,{"$f":"IF(COUNTIF(L6, \"*審査あり*\" ),\"年度\",\"\")","v":""},null,null,null,null,{"$f":"IF(L6=\"\", \"\", IF(COUNTIF(O7, \"*インスティテュート*\"), \"\", IF(COUNTIF(L6, \"*審査あり*\"), \"専攻\", \"\")))","v":""},null,null,"◆過去の本学大学院での個別の入学資格審査有無"]
["氏名",null,null,null,"姓（Family Name）",null,null,null,null,null,"名（First Name）",null,null,null,null,null,"性別",null,null,null,null,null,"・",{"$f":"IF(L6=\"\", \"「審査有無」欄が未入力となっています。\",\n   IF(L6=\"過去に審査なし\",\"\",\n   IF(AND(L7=\"\", O7=\"\"), \"「審査年度・専攻」欄が空白となっています。\",\n      IF(AND(L7=\"\", O7<>\"\"), \"「審査年度」欄が空白となっています。\",\n         IF(AND(L7<>\"\", O7=\"\"), \"「専攻」欄が空白となっています。\", \"\")\n      )\n   ))\n)","v":"「審査有無」欄が未入力となっています。"}]
[null,"フリガナ"]
[null,"漢字表記",null,null,null,null,null,null,null,null,null,null,null,null,null,null,null,null,null,null,null,"◆「氏名」「性別」「国籍」「生年月日」欄の入力"]
[null,"英語表記",null,null,null,null,null,null,null,null,null,null,null,null,null,null,"国籍",null,null,null,null,null,"・",{"$f":"IF(OR(E9=\"\",K9=\"\"),\"「フリガナ」欄が未入力となっています。姓名の両方とも入力してください。\",\"「フリガナ」：入力OK\")","v":"「フリガナ」欄が未入力となっています。姓名の両方とも入力してください。"}]
["生年月日（西暦）",null,null,null,null,"年",null,"月",null,"日生","2027年4月1日時点、満",null,null,null,{"$f":"IF(OR(D12=\"\",G12=\"\",I12=\"\"),\"\",DATEDIF(DATE(D12,G12,I12),\"2027/4/1\",\"Y\"))","v":""},"才",null,null,null,null,null,null,"・",{"$f":"IF(OR(E10=\"\",K10=\"\"),\"「漢字表記」欄が未入力となっています。姓名の両方とも入力してください。※漢字表記がない国出身の志願者は、自国語で入力してください。\",\"「漢字表記」：入力OK\")","v":"「漢字表記」欄が未入力となっています。姓名の両方とも入力してください。※漢字表記がない国出身の志願者は、自国語で入力してください。"}]
["学歴",null,null,null,null,null,null,null,null,null,null,null,null,null,null,null,null,null,null,null,null,null,"・",{"$f":"IF(OR(E11=\"\",K11=\"\"),\"「英語表記」欄が未入力となっています。姓名の両方とも入力してください。※パスポートの記載と同じものを入力してください。\",\"「英語表記」：入力OK\")","v":"「英語表記」欄が未入力となっています。姓名の両方とも入力してください。※パスポートの記載と同じものを入力してください。"}]
["学校区分",null,null,"学校名（学部・学科名 / 研究科・専攻名は省略せず記入）",null,null,null,null,null,null,null,null,"在学期間（西暦で記入）",null,null,null,null,null,null,null,null,null,"・",{"$f":"IF(R8=\"\",\"「性別」欄が未入力となっています。右下の「▼」マークをクリックして、性別を選択してください。\",\"「　性別　」：入力OK\")","v":"「性別」欄が未入力となっています。右下の「▼」マークをクリックして、性別を選択してください。"}]
[null,null,null,null,null,null,null,null,null,null,null,null,null,null,"年",null,"月",null,null,null,null,null,"・",{"$f":"IF(R11=\"\",\"「国籍」欄が未入力となっています。右下の「▼」マークをクリックして、国籍を選択してください。\",\"「　国籍　」：入力OK\")","v":"「国籍」欄が未入力となっています。右下の「▼」マークをクリックして、国籍を選択してください。"}]
[null,null,null,null,null,null,null,null,null,null,null,null,null,null,"年",null,"月",null,null,null,null,null,"・",{"$f":"IF(OR(D12=\"\",G12=\"\",I12=\"\"),\"「生年月日」が未入力となっています。※年齢は入力後に自動で算出されます。\",\"「生年月日」：入力OK\")","v":"「生年月日」が未入力となっています。※年齢は入力後に自動で算出されます。"}]
[null,null,null,null,null,null,null,null,null,null,null,null,null,null,"年",null,"月"]
[null,null,null,null,null,null,null,null,null,null,null,null,null,null,"年",null,"月",null,null,null,null,"◆「学歴」欄の入力",null,null,null,null,null,null,null,null,"※大学や大学院などの場合、「学部・学科名」「研究科・専攻名」も省略せずに記入してください。"]
[null,null,null,null,null,null,null,null,null,null,null,null,null,null,"年",null,"月"]
[null,null,null,null,null,null,null,null,null,null,null,null,null,null,"年",null,"月",null,null,null,null,null,"＜日本国籍志願者＞"]
{"$rows_left_out":62}
{"sheet":"「志願先」欄  選択一覧","index":2,"n_rows":202,"n_cols":7,"rows_kept":202,"cut":false,"hidden":false,"merged":[[1,1,1,6],[0,0,0,6]]}
["「志願先」欄  選択一覧"]
["※\n※","手書きで「入学志願票（個別の入学資格審査用）」を作成される場合、「志願先」欄は以下の組合せからご記入ください。\n「⑥修士課程と研修生の併願」は「併願可」とある場合、併願を「希望する／希望しない」のいずれかをご記入ください。\nただし「併願可」とある場合も、秋季入試では入試経路によっては併願できない場合がありますので、入試要項をご確認ください。"]
["No","①課程","②研究科","③専攻","④入試経路","⑤その他選択","⑥修士課程と研修生の併願"]
[{"$f":"ROW()-3","v":1},"修士課程","人文科学研究科","哲学専攻","一般入試","なし","併願可"]
[{"$f":"ROW()-3","v":2},"修士課程","人文科学研究科","哲学専攻","社会人入試","なし","併願可"]
[3,"修士課程","人文科学研究科","日本文学専攻","一般入試","プログラム選択なし","併願可"]
[4,"修士課程","人文科学研究科","日本文学専攻","一般入試","文芸創作研究プログラム","併願可"]
[5,"修士課程","人文科学研究科","日本文学専攻","一般入試","能楽研究者育成プログラム","併願可"]
[6,"修士課程","人文科学研究科","日本文学専攻","外国人入試","プログラム選択なし","併願可"]
[7,"修士課程","人文科学研究科","日本文学専攻","外国人入試","文芸創作研究プログラム","併願可"]
[8,"修士課程","人文科学研究科","日本文学専攻","外国人入試","能楽研究者育成プログラム","併願可"]
[9,"修士課程","人文科学研究科","日本文学専攻","社会人入試","プログラム選択なし","併願可"]
[10,"修士課程","人文科学研究科","日本文学専攻","社会人入試","文芸創作研究プログラム","併願可"]
[11,"修士課程","人文科学研究科","日本文学専攻","社会人入試","能楽研究者育成プログラム","併願可"]
[12,"修士課程","人文科学研究科","英文学専攻","一般入試","なし","併願可"]
[13,"修士課程","人文科学研究科","英文学専攻","社会人入試","なし","併願可"]
[14,"修士課程","人文科学研究科","史学専攻","一般入試","なし","併願可"]
[15,"修士課程","人文科学研究科","史学専攻","社会人入試","なし","併願可"]
[16,"修士課程","人文科学研究科","地理学専攻","一般入試","なし","併願可"]
[{"$f":"ROW()-3","v":17},"修士課程","人文科学研究科","地理学専攻","外国人入試","なし","併願可"]
{"$rows_left_out":183}
{"sheet":"「志願先」欄 選択一覧（検索用）","index":3,"n_rows":217,"n_cols":36,"rows_kept":217,"cut":false,"hidden":true,"merged":[]}
["「志願先」欄  選択一覧（検索用）"]
[]
["No","①課程","①連番","①検索値","②研究科","②連番","②検索値","③専攻","①③","①③連番","①③検索値","④入試経路","①③④","①③④連番","①③④検索値","①②③④","⑤その他選択","⑥修士課程と研修生の併願",null,null,null,null,null,"志願票選択値","課程",{"$f":"'入学志願票（個別の入学資格審査用）'!D3","v":0},null,null,null,"https://detail.chiebukuro.yahoo.co.jp/qa/question_detail/q1366987793"]
[1,"修士課程",1,"修士課程1","人文科学研究科",1,"人文科学研究科1","哲学専攻","修士課程哲学専攻",1,"修士課程哲学専攻1","一般入試","修士課程哲学専攻一般入試",1,"修士課程哲学専攻一般入試1","修士課程人文科学研究科哲学専攻一般入試","なし","併願可",null,null,null,null,null,null,"研究科",{"$f":"'入学志願票（個別の入学資格審査用）'!H3","v":0}]
[2,"修士課程",2,"修士課程2","人文科学研究科",2,"人文科学研究科2","哲学専攻","修士課程哲学専攻",2,"修士課程哲学専攻2","社会人入試","修士課程哲学専攻社会人入試",1,"修士課程哲学専攻社会人入試1","修士課程人文科学研究科哲学専攻社会人入試","なし","併願可",null,null,null,null,null,null,"専攻",{"$f":"'入学志願票（個別の入学資格審査用）'!N3","v":0}]
[3,"修士課程",3,"修士課程3","人文科学研究科",3,"人文科学研究科3","日本文学専攻","修士課程日本文学専攻",1,"修士課程日本文学専攻1","一般入試","修士課程日本文学専攻一般入試",1,"修士課程日本文学専攻一般入試1","修士課程人文科学研究科日本文学専攻一般入試","プログラム選択なし","併願可",null,null,null,null,null,null,"入試経路",{"$f":"'入学志願票（個別の入学資格審査用）'!D4","v":0}]
[4,"修士課程",4,"修士課程4","人文科学研究科",4,"人文科学研究科4","日本文学専攻","修士課程日本文学専攻",2,"修士課程日本文学専攻2","一般入試","修士課程日本文学専攻一般入試",2,"修士課程日本文学専攻一般入試2","修士課程人文科学研究科日本文学専攻一般入試","文芸創作研究プログラム","併願可",null,null,null,null,null,null,{"$f":"'入学志願票（個別の入学資格審査用）'!I4","v":"⑤その他選択"},{"$f":"'入学志願票（個別の入学資格審査用）'!L4","v":0}]
[5,"修士課程",5,"修士課程5","人文科学研究科",5,"人文科学研究科5","日本文学専攻","修士課程日本文学専攻",3,"修士課程日本文学専攻3","一般入試","修士課程日本文学専攻一般入試",3,"修士課程日本文学専攻一般入試3","修士課程人文科学研究科日本文学専攻一般入試","能楽研究者育成プログラム","併願可",null,null,null,null,null,null,{"$f":"'入学志願票（個別の入学資格審査用）'!B5","v":"⑥修士課程と研修生の併願"}]
[6,"修士課程",6,"修士課程6","人文科学研究科",6,"人文科学研究科6","日本文学専攻","修士課程日本文学専攻",4,"修士課程日本文学専攻4","外国人入試","修士課程日本文学専攻外国人入試",1,"修士課程日本文学専攻外国人入試1","修士課程人文科学研究科日本文学専攻外国人入試","プログラム選択なし","併願可"]
[7,"修士課程",7,"修士課程7","人文科学研究科",7,"人文科学研究科7","日本文学専攻","修士課程日本文学専攻",5,"修士課程日本文学専攻5","外国人入試","修士課程日本文学専攻外国人入試",2,"修士課程日本文学専攻外国人入試2","修士課程人文科学研究科日本文学専攻外国人入試","文芸創作研究プログラム","併願可",null,null,null,null,"ドロップダウンリスト"]
[8,"修士課程",8,"修士課程8","人文科学研究科",8,"人文科学研究科8","日本文学専攻","修士課程日本文学専攻",6,"修士課程日本文学専攻6","外国人入試","修士課程日本文学専攻外国人入試",3,"修士課程日本文学専攻外国人入試3","修士課程人文科学研究科日本文学専攻外国人入試","能楽研究者育成プログラム","併願可",null,null,null,null,"連番","B2_研究科","B重複チェック","B2重複除く一覧","C2_専攻","C2重複チェック","C2重複を除く一覧","D2_入試経路","D2重複チェック","D2重複を除く一覧","E2_その他の選択","E2重複チェック","E2重複を除く一覧","併願"]
[9,"修士課程",9,"修士課程9","人文科学研究科",9,"人文科学研究科9","日本文学専攻","修士課程日本文学専攻",7,"修士課程日本文学専攻7","社会人入試","修士課程日本文学専攻社会人入試",1,"修士課程日本文学専攻社会人入試1","修士課程人文科学研究科日本文学専攻社会人入試","プログラム選択なし","併願可"]
[10,"修士課程",10,"修士課程10","人文科学研究科",10,"人文科学研究科10","日本文学専攻","修士課程日本文学専攻",8,"修士課程日本文学専攻8","社会人入試","修士課程日本文学専攻社会人入試",2,"修士課程日本文学専攻社会人入試2","修士課程人文科学研究科日本文学専攻社会人入試","文芸創作研究プログラム","併願可",null,null,null,null,1,{"$f":"IFERROR(VLOOKUP($Z$3&W13,$D:$E,2,0),\"\")","v":""},{"$f":"IF(COUNTIF($X$13:X13,X13)=1,Y12+1,Y12)","v":1},{"$f":"IFERROR(INDEX($X$13:$X$217,MATCH(ROW(Z13)-12,$Y$13:$Y$217,0)),\"\")","v":""},{"$f":"VLOOKUP($Z$4&W13,$G:$H,2,0)","v":{"$error":"#N/A"}},{"$f":"IF(COUNTIF($AA$13:AA13,AA13)=1,AB12+1,AB12)","v":1},{"$f":"IFERROR(INDEX($AA$13:$AA$201,MATCH(ROW(AC13)-12,$AB$13:$AB$201,0)),\"\")","v":""},{"$f":"VLOOKUP($Z$3&$Z$5&W13,$K:$L,2,0)","v":{"$error":"#N/A"}},{"$f":"IF(COUNTIF($AD$13:AD13,AD13)=1,AE12+1,AE12)","v":1},{"$f":"IFERROR(INDEX($AD$13:$AD$201,MATCH(ROW(AF13)-12,$AE$13:$AE$201,0)),\"\")","v":""},{"$f":"IFERROR(VLOOKUP($Z$3&$Z$5&$Z$6&W13,$O:$R,3,0),\"\")","v":""},{"$f":"IF(COUNTIF($AG$13:AG13,AG13)=1,AH12+1,AH12)","v":1},{"$f":"IF(AG13=\"なし\",\"\",\nIFERROR(INDEX($AG$13:$AG$201,MATCH(ROW(AI13)-12,$AH$13:$AH$201,0)),\"\")\n)","v":""},{"$f":"IF(AND(Z3:Z6<>0,$Y$8=\"⑥修士課程と研修生の併願\"),\"併願を希望する\",\"\")","v":""}]
[11,"修士課程",11,"修士課程11","人文科学研究科",11,"人文科学研究科11","日本文学専攻","修士課程日本文学専攻",9,"修士課程日本文学専攻9","社会人入試","修士課程日本文学専攻社会人入試",3,"修士課程日本文学専攻社会人入試3","修士課程人文科学研究科日本文学専攻社会人入試","能楽研究者育成プログラム","併願可",null,null,null,null,2,"",{"$f":"IF(COUNTIF($X$13:X14,X14)=1,Y13+1,Y13)","v":1},{"$f":"IFERROR(INDEX($X$13:$X$201,MATCH(ROW(Z14)-12,$Y$13:$Y$201,0)),\"\")","v":""},{"$error":"#N/A"},{"$f":"IF(COUNTIF($AA$13:AA14,AA14)=1,AB13+1,AB13)","v":1},{"$f":"IFERROR(INDEX($AA$13:$AA$201,MATCH(ROW(AC14)-12,$AB$13:$AB$201,0)),\"\")","v":""},{"$error":"#N/A"},{"$f":"IF(COUNTIF($AD$13:AD14,AD14)=1,AE13+1,AE13)","v":1},{"$f":"IFERROR(INDEX($AD$13:$AD$201,MATCH(ROW(AF14)-12,$AE$13:$AE$201,0)),\"\")","v":""},"",{"$f":"IF(COUNTIF($AG$13:AG14,AG14)=1,AH13+1,AH13)","v":1},"",{"$f":"IF(AND(Z3:Z6<>0,$Y$8=\"⑥修士課程と研修生の併願\"),\"併願を希望しない\",\"\")","v":""}]
[12,"修士課程",12,"修士課程12","人文科学研究科",12,"人文科学研究科12","英文学専攻","修士課程英文学専攻",1,"修士課程英文学専攻1","一般入試","修士課程英文学専攻一般入試",1,"修士課程英文学専攻一般入試1","修士課程人文科学研究科英文学専攻一般入試","なし","併願可",null,null,null,null,3,"",{"$f":"IF(COUNTIF($X$13:X15,X15)=1,Y14+1,Y14)","v":1},{"$f":"IFERROR(INDEX($X$13:$X$217,MATCH(ROW(Z15)-12,$Y$13:$Y$217,0)),\"\")","v":""},{"$error":"#N/A"},{"$f":"IF(COUNTIF($AA$13:AA15,AA15)=1,AB14+1,AB14)","v":1},{"$f":"IFERROR(INDEX($AA$13:$AA$201,MATCH(ROW(AC15)-12,$AB$13:$AB$201,0)),\"\")","v":""},{"$error":"#N/A"},{"$f":"IF(COUNTIF($AD$13:AD15,AD15)=1,AE14+1,AE14)","v":1},{"$f":"IFERROR(INDEX($AD$13:$AD$201,MATCH(ROW(AF15)-12,$AE$13:$AE$201,0)),\"\")","v":""},"",{"$f":"IF(COUNTIF($AG$13:AG15,AG15)=1,AH14+1,AH14)","v":1},""]
[13,"修士課程",13,"修士課程13","人文科学研究科",13,"人文科学研究科13","英文学専攻","修士課程英文学専攻",2,"修士課程英文学専攻2","社会人入試","修士課程英文学専攻社会人入試",1,"修士課程英文学専攻社会人入試1","修士課程人文科学研究科英文学専攻社会人入試","なし","併願可",null,null,null,null,4,"",{"$f":"IF(COUNTIF($X$13:X16,X16)=1,Y15+1,Y15)","v":1},{"$f":"IFERROR(INDEX($X$13:$X$201,MATCH(ROW(Z16)-12,$Y$13:$Y$201,0)),\"\")","v":""},{"$error":"#N/A"},{"$f":"IF(COUNTIF($AA$13:AA16,AA16)=1,AB15+1,AB15)","v":1},"",{"$error":"#N/A"},{"$f":"IF(COUNTIF($AD$13:AD16,AD16)=1,AE15+1,AE15)","v":1},"","",{"$f":"IF(COUNTIF($AG$13:AG16,AG16)=1,AH15+1,AH15)","v":1},""]
[14,"修士課程",14,"修士課程14","人文科学研究科",14,"人文科学研究科14","史学専攻","修士課程史学専攻",1,"修士課程史学専攻1","一般入試","修士課程史学専攻一般入試",1,"修士課程史学専攻一般入試1","修士課程人文科学研究科史学専攻一般入試","なし","併願可",null,null,null,null,5,"",{"$f":"IF(COUNTIF($X$13:X17,X17)=1,Y16+1,Y16)","v":1},{"$f":"IFERROR(INDEX($X$13:$X$217,MATCH(ROW(Z17)-12,$Y$13:$Y$217,0)),\"\")","v":""},{"$error":"#N/A"},{"$f":"IF(COUNTIF($AA$13:AA17,AA17)=1,AB16+1,AB16)","v":1},"",{"$error":"#N/A"},{"$f":"IF(COUNTIF($AD$13:AD17,AD17)=1,AE16+1,AE16)","v":1},"","",{"$f":"IF(COUNTIF($AG$13:AG17,AG17)=1,AH16+1,AH16)","v":1},""]
[15,"修士課程",15,"修士課程15","人文科学研究科",15,"人文科学研究科15","史学専攻","修士課程史学専攻",2,"修士課程史学専攻2","社会人入試","修士課程史学専攻社会人入試",1,"修士課程史学専攻社会人入試1","修士課程人文科学研究科史学専攻社会人入試","なし","併願可",null,null,null,null,6,"",{"$f":"IF(COUNTIF($X$13:X18,X18)=1,Y17+1,Y17)","v":1},{"$f":"IFERROR(INDEX($X$13:$X$201,MATCH(ROW(Z18)-12,$Y$13:$Y$201,0)),\"\")","v":""},{"$error":"#N/A"},{"$f":"IF(COUNTIF($AA$13:AA18,AA18)=1,AB17+1,AB17)","v":1},"",{"$error":"#N/A"},{"$f":"IF(COUNTIF($AD$13:AD18,AD18)=1,AE17+1,AE17)","v":1},"","",{"$f":"IF(COUNTIF($AG$13:AG18,AG18)=1,AH17+1,AH17)","v":1},""]
[16,"修士課程",16,"修士課程16","人文科学研究科",16,"人文科学研究科16","地理学専攻","修士課程地理学専攻",1,"修士課程地理学専攻1","一般入試","修士課程地理学専攻一般入試",1,"修士課程地理学専攻一般入試1","修士課程人文科学研究科地理学専攻一般入試","なし","併願可",null,null,null,null,7,"",{"$f":"IF(COUNTIF($X$13:X19,X19)=1,Y18+1,Y18)","v":1},{"$f":"IFERROR(INDEX($X$13:$X$217,MATCH(ROW(Z19)-12,$Y$13:$Y$217,0)),\"\")","v":""},{"$error":"#N/A"},{"$f":"IF(COUNTIF($AA$13:AA19,AA19)=1,AB18+1,AB18)","v":1},"",{"$error":"#N/A"},{"$f":"IF(COUNTIF($AD$13:AD19,AD19)=1,AE18+1,AE18)","v":1},"","",{"$f":"IF(COUNTIF($AG$13:AG19,AG19)=1,AH18+1,AH18)","v":1},""]
[17,"修士課程",17,"修士課程17","人文科学研究科",17,"人文科学研究科17","地理学専攻","修士課程地理学専攻",2,"修士課程地理学専攻2","外国人入試","修士課程地理学専攻外国人入試",1,"修士課程地理学専攻外国人入試1","修士課程人文科学研究科地理学専攻外国人入試","なし","併願可",null,null,null,null,8,"",{"$f":"IF(COUNTIF($X$13:X20,X20)=1,Y19+1,Y19)","v":1},{"$f":"IFERROR(INDEX($X$13:$X$201,MATCH(ROW(Z20)-12,$Y$13:$Y$201,0)),\"\")","v":""},{"$error":"#N/A"},{"$f":"IF(COUNTIF($AA$13:AA20,AA20)=1,AB19+1,AB19)","v":1},"",{"$error":"#N/A"},{"$f":"IF(COUNTIF($AD$13:AD20,AD20)=1,AE19+1,AE19)","v":1},"","",{"$f":"IF(COUNTIF($AG$13:AG20,AG20)=1,AH19+1,AH19)","v":1},""]
{"$rows_left_out":198}
{"sheet":"「受験科目」欄 選択一覧（編集用）","index":4,"n_rows":290,"n_cols":6,"rows_kept":290,"cut":false,"hidden":true,"merged":[]}
["「受験科目」欄  選択一覧（編集用）"]
[]
["A_課程","B_研究科","C_専攻","D_入試経路","専門科目","外国語"]
["修士課程","人文科学研究科","哲学専攻","一般入試","専門科目","外国語（言語は当日選択）"]
["修士課程","人文科学研究科","哲学専攻","社会人入試","専門科目","なし"]
["修士課程","人文科学研究科","日本文学専攻","一般入試","専門科目","英語"]
["修士課程","人文科学研究科","日本文学専攻","一般入試","専門科目","英語"]
["修士課程","人文科学研究科","日本文学専攻","一般入試","専門科目","英語"]
["修士課程","人文科学研究科","日本文学専攻","外国人入試","専門科目","日本語"]
["修士課程","人文科学研究科","日本文学専攻","外国人入試","専門科目","日本語"]
["修士課程","人文科学研究科","日本文学専攻","外国人入試","専門科目","日本語"]
["修士課程","人文科学研究科","日本文学専攻","社会人入試","専門科目","なし"]
["修士課程","人文科学研究科","英文学専攻","一般入試","筆記試験なし","筆記試験なし"]
["修士課程","人文科学研究科","英文学専攻","社会人入試","筆記試験なし","筆記試験なし"]
["修士課程","人文科学研究科","史学専攻","一般入試","日本史分野","英語"]
["修士課程","人文科学研究科","史学専攻","一般入試","東洋史分野","英語"]
["修士課程","人文科学研究科","史学専攻","一般入試","西洋史分野","英語"]
["修士課程","人文科学研究科","史学専攻","社会人入試","小論文（日本史分野）","なし"]
["修士課程","人文科学研究科","史学専攻","社会人入試","小論文（東洋史分野）","なし"]
["修士課程","人文科学研究科","史学専攻","社会人入試","小論文（西洋史分野）","なし"]
{"$rows_left_out":271}
{"sheet":"「受験科目」欄 選択一覧（検索用）","index":5,"n_rows":289,"n_cols":23,"rows_kept":289,"cut":false,"hidden":true,"merged":[]}
[]
[null,"A_課程","B_研究科","C_専攻","D_入試経路","A＋B＋C＋D","連番_A＋B＋C＋D","ABCD＋連番","専門科目","外国語",null,null,null,null,null,null,"志願票選択値",{"$f":"'入学志願票（個別の入学資格審査用）'!D3&'入学志願票（個別の入学資格審査用）'!H3&'入学志願票（個別の入学資格審査用）'!N3&'入学志願票（個別の入学資格審査用）'!D4","v":""}]
[null,"修士課程","人文科学研究科","哲学専攻","一般入試","修士課程人文科学研究科哲学専攻一般入試",1,"修士課程人文科学研究科哲学専攻一般入試1","専門科目","外国語（言語は当日選択）"]
[null,"修士課程","人文科学研究科","哲学専攻","社会人入試","修士課程人文科学研究科哲学専攻社会人入試",1,"修士課程人文科学研究科哲学専攻社会人入試1","専門科目","なし",null,null,null,null,null,null,"連番","A専門科目","A重複チェック","A重複除く一覧","B_外国語","B重複チェック","B重複除く一覧"]
[null,"修士課程","人文科学研究科","日本文学専攻","一般入試","修士課程人文科学研究科日本文学専攻一般入試",1,"修士課程人文科学研究科日本文学専攻一般入試1","専門科目","英語"]
[null,"修士課程","人文科学研究科","日本文学専攻","一般入試","修士課程人文科学研究科日本文学専攻一般入試",2,"修士課程人文科学研究科日本文学専攻一般入試2","専門科目","英語",null,null,null,null,null,null,1,{"$f":"VLOOKUP($R$2&Q6,$H:$J,2,0)","v":{"$error":"#N/A"}},{"$f":"IF(COUNTIF($R$6:R6,R6)=1,S5+1,S5)","v":1},{"$f":"IFERROR(INDEX($R$6:$R$75,MATCH(ROW(T6)-5,$S$6:$S$75,0)),\"\")","v":""},{"$f":"VLOOKUP($R$2&Q6,$H:$J,3,0)","v":{"$error":"#N/A"}},{"$f":"IF(COUNTIF($U$6:U6,U6)=1,V5+1,V5)","v":1},{"$f":"IFERROR(INDEX($U$6:$U$75,MATCH(ROW(W6)-5,$V$6:$V$75,0)),\"\")","v":""}]
[null,"修士課程","人文科学研究科","日本文学専攻","一般入試","修士課程人文科学研究科日本文学専攻一般入試",3,"修士課程人文科学研究科日本文学専攻一般入試3","専門科目","英語",null,null,null,null,null,null,2,{"$error":"#N/A"},{"$f":"IF(COUNTIF($R$6:R7,R7)=1,S6+1,S6)","v":1},{"$f":"IFERROR(INDEX($R$6:$R$75,MATCH(ROW(T7)-5,$S$6:$S$75,0)),\"\")","v":""},{"$error":"#N/A"},{"$f":"IF(COUNTIF($U$6:U7,U7)=1,V6+1,V6)","v":1},{"$f":"IFERROR(INDEX($U$6:$U$75,MATCH(ROW(W7)-5,$V$6:$V$75,0)),\"\")","v":""}]
[null,"修士課程","人文科学研究科","日本文学専攻","外国人入試","修士課程人文科学研究科日本文学専攻外国人入試",1,"修士課程人文科学研究科日本文学専攻外国人入試1","専門科目","日本語",null,null,null,null,null,null,3,{"$error":"#N/A"},{"$f":"IF(COUNTIF($R$6:R8,R8)=1,S7+1,S7)","v":1},"",{"$error":"#N/A"},{"$f":"IF(COUNTIF($U$6:U8,U8)=1,V7+1,V7)","v":1},""]
[null,"修士課程","人文科学研究科","日本文学専攻","外国人入試","修士課程人文科学研究科日本文学専攻外国人入試",2,"修士課程人文科学研究科日本文学専攻外国人入試2","専門科目","日本語",null,null,null,null,null,null,4,{"$error":"#N/A"},{"$f":"IF(COUNTIF($R$6:R9,R9)=1,S8+1,S8)","v":1},"",{"$error":"#N/A"},{"$f":"IF(COUNTIF($U$6:U9,U9)=1,V8+1,V8)","v":1},""]
[null,"修士課程","人文科学研究科","日本文学専攻","外国人入試","修士課程人文科学研究科日本文学専攻外国人入試",3,"修士課程人文科学研究科日本文学専攻外国人入試3","専門科目","日本語",null,null,null,null,null,null,5,{"$error":"#N/A"},{"$f":"IF(COUNTIF($R$6:R10,R10)=1,S9+1,S9)","v":1},"",{"$error":"#N/A"},{"$f":"IF(COUNTIF($U$6:U10,U10)=1,V9+1,V9)","v":1},""]
[null,"修士課程","人文科学研究科","日本文学専攻","社会人入試","修士課程人文科学研究科日本文学専攻社会人入試",1,"修士課程人文科学研究科日本文学専攻社会人入試1","専門科目","なし",null,null,null,null,null,null,6,{"$error":"#N/A"},{"$f":"IF(COUNTIF($R$6:R11,R11)=1,S10+1,S10)","v":1},"",{"$error":"#N/A"},{"$f":"IF(COUNTIF($U$6:U11,U11)=1,V10+1,V10)","v":1},""]
[null,"修士課程","人文科学研究科","英文学専攻","一般入試","修士課程人文科学研究科英文学専攻一般入試",1,"修士課程人文科学研究科英文学専攻一般入試1","筆記試験なし","筆記試験なし",null,null,null,null,null,null,7,{"$error":"#N/A"},{"$f":"IF(COUNTIF($R$6:R12,R12)=1,S11+1,S11)","v":1},"",{"$error":"#N/A"},{"$f":"IF(COUNTIF($U$6:U12,U12)=1,V11+1,V11)","v":1},""]
[null,"修士課程","人文科学研究科","英文学専攻","社会人入試","修士課程人文科学研究科英文学専攻社会人入試",1,"修士課程人文科学研究科英文学専攻社会人入試1","筆記試験なし","筆記試験なし",null,null,null,null,null,null,8,{"$error":"#N/A"},{"$f":"IF(COUNTIF($R$6:R13,R13)=1,S12+1,S12)","v":1},"",{"$error":"#N/A"},{"$f":"IF(COUNTIF($U$6:U13,U13)=1,V12+1,V12)","v":1},""]
[null,"修士課程","人文科学研究科","史学専攻","一般入試","修士課程人文科学研究科史学専攻一般入試",1,"修士課程人文科学研究科史学専攻一般入試1","日本史分野","英語",null,null,null,null,null,null,9,{"$error":"#N/A"},{"$f":"IF(COUNTIF($R$6:R14,R14)=1,S13+1,S13)","v":1},"",{"$error":"#N/A"},{"$f":"IF(COUNTIF($U$6:U14,U14)=1,V13+1,V13)","v":1},""]
[null,"修士課程","人文科学研究科","史学専攻","一般入試","修士課程人文科学研究科史学専攻一般入試",2,"修士課程人文科学研究科史学専攻一般入試2","東洋史分野","英語",null,null,null,null,null,null,10,{"$error":"#N/A"},{"$f":"IF(COUNTIF($R$6:R15,R15)=1,S14+1,S14)","v":1},"",{"$error":"#N/A"},{"$f":"IF(COUNTIF($U$6:U15,U15)=1,V14+1,V14)","v":1},""]
[null,"修士課程","人文科学研究科","史学専攻","一般入試","修士課程人文科学研究科史学専攻一般入試",3,"修士課程人文科学研究科史学専攻一般入試3","西洋史分野","英語",null,null,null,null,null,null,11,{"$error":"#N/A"},{"$f":"IF(COUNTIF($R$6:R16,R16)=1,S15+1,S15)","v":1},"",{"$error":"#N/A"},{"$f":"IF(COUNTIF($U$6:U16,U16)=1,V15+1,V15)","v":1},""]
[null,"修士課程","人文科学研究科","史学専攻","社会人入試","修士課程人文科学研究科史学専攻社会人入試",1,"修士課程人文科学研究科史学専攻社会人入試1","小論文（日本史分野）","なし",null,null,null,null,null,null,12,{"$error":"#N/A"},{"$f":"IF(COUNTIF($R$6:R17,R17)=1,S16+1,S16)","v":1},"",{"$error":"#N/A"},{"$f":"IF(COUNTIF($U$6:U17,U17)=1,V16+1,V16)","v":1},""]
[null,"修士課程","人文科学研究科","史学専攻","社会人入試","修士課程人文科学研究科史学専攻社会人入試",2,"修士課程人文科学研究科史学専攻社会人入試2","小論文（東洋史分野）","なし",null,null,null,null,null,null,13,{"$error":"#N/A"},{"$f":"IF(COUNTIF($R$6:R18,R18)=1,S17+1,S17)","v":1},"",{"$error":"#N/A"},{"$f":"IF(COUNTIF($U$6:U18,U18)=1,V17+1,V17)","v":1},""]
[null,"修士課程","人文科学研究科","史学専攻","社会人入試","修士課程人文科学研究科史学専攻社会人入試",3,"修士課程人文科学研究科史学専攻社会人入試3","小論文（西洋史分野）","なし",null,null,null,null,null,null,14,{"$error":"#N/A"},{"$f":"IF(COUNTIF($R$6:R19,R19)=1,S18+1,S18)","v":1},"",{"$error":"#N/A"},{"$f":"IF(COUNTIF($U$6:U19,U19)=1,V18+1,V18)","v":1},""]
[null,"修士課程","人文科学研究科","地理学専攻","一般入試","修士課程人文科学研究科地理学専攻一般入試",1,"修士課程人文科学研究科地理学専攻一般入試1","自然地理分野","英語（母語は選択不可）",null,null,null,null,null,null,15,{"$error":"#N/A"},{"$f":"IF(COUNTIF($R$6:R20,R20)=1,S19+1,S19)","v":1},"",{"$error":"#N/A"},{"$f":"IF(COUNTIF($U$6:U20,U20)=1,V19+1,V19)","v":1},""]
{"$rows_left_out":269}