{"text_format":"1","workbook":"xlsx","n_sheets":5,"sheets":["様式2_入学志願票（入学試験面接カード）","「志願先」欄  選択一覧","志願先選択一覧（リスト検索用）","科目選択","その他入力規則"],"not_rendered":{"charts":0,"images":0,"macros":1,"external_links":0,"defined_names":1,"comments":0,"pivot_tables":0},"unopened":[],"bounds":{"document_bytes":16777216,"sheet_cells":100000,"rows_first":2000,"rows_last":500,"rows_between":2000,"halvings":0,"cell_chars":16384,"cell_head_chars":4096},"cells_cut":0,"cells_raw":0,"read":"whole","date_system":"1900"}

{"sheet":"様式2_入学志願票（入学試験面接カード）","index":0,"n_rows":81,"n_cols":33,"rows_kept":81,"cut":false,"hidden":false,"merged":[[80,0,80,3],[80,4,80,18],[2,1,2,2],[2,3,2,4],[2,5,2,6],[2,7,2,10],[2,11,2,12],[2,13,2,15],[3,1,3,2],[76,1,76,2],[76,6,77,18],[77,1,77,2],[77,4,77,5],[78,1,79,3],[78,4,79,18],[72,1,72,2],[72,6,73,18],[73,1,73,2],[74,1,74,2],[74,6,75,18],[75,1,75,2],[66,6,67,18],[67,1,67,2],[68,1,68,2],[68,6,69,18],[69,1,69,2],[70,1,70,2],[70,6,71,18],[71,1,71,2],[61,0,79,0],[61,1,61,5],[61,6,61,18],[62,1,62,2],[62,6,63,18],[63,1,63,2],[64,1,64,2],[64,6,65,18],[65,1,65,2],[66,1,66,2],[58,0,58,1],[58,2,58,18],[59,0,60,0],[59,1,59,2],[59,3,59,9],[59,10,59,11],[59,12,59,18],[60,1,60,2],[60,3,60,18],[49,2,55,2],[56,0,56,18],[57,0,57,18],[46,0,46,1],[46,10,46,11],[46,2,46,3],[46,4,46,9],[46,12,46,18],[47,0,47,6],[47,7,47,18],[48,0,55,1],[48,3,48,18],[49,3,55,18],[44,0,44,1],[44,5,44,7],[44,8,44,11],[44,12,44,18],[45,0,45,1],[45,5,45,7],[45,8,45,11],[45,12,45,18],[40,0,40,6],[40,7,40,18],[41,0,41,6],[41,7,41,18],[42,0,42,18],[43,0,43,4],[43,5,43,7],[43,8,43,11],[43,12,43,18],[38,0,39,2],[38,3,39,11],[38,12,38,13],[38,17,38,18],[39,12,39,13],[39,17,39,18],[36,0,37,2],[36,3,37,11],[36,12,36,13],[36,17,36,18],[37,12,37,13],[37,17,37,18],[34,0,35,2],[34,3,35,11],[34,12,34,13],[34,17,34,18],[35,12,35,13],[35,17,35,18],[32,0,33,2],[32,3,33,11],[32,12,32,13],[32,17,32,18],[33,12,33,13],[33,17,33,18],[30,0,31,2],[30,3,31,11],[30,12,30,13],[30,17,30,18],[31,12,31,13],[31,17,31,18],[28,0,29,2],[28,3,29,11],[28,12,28,13],[28,17,28,18],[29,12,29,13],[29,17,29,18],[26,0,27,2],[26,3,27,11],[26,12,26,13],[26,17,26,18],[27,12,27,13],[27,17,27,18],[24,0,25,2],[24,3,25,11],[24,12,24,13],[24,17,24,18],[25,12,25,13],[25,17,25,18],[22,0,23,2],[22,3,23,11],[22,12,22,13],[22,17,22,18],[23,12,23,13],[23,17,23,18],[20,0,21,2],[20,3,21,11],[20,12,20,13],[20,17,20,18],[21,12,21,13],[21,17,21,18],[18,0,19,2],[18,3,19,11],[18,12,18,13],[18,17,18,18],[19,12,19,13],[19,17,19,18],[16,0,17,2],[16,3,17,11],[16,12,16,13],[16,17,16,18],[17,12,17,13],[17,17,17,18],[14,0,15,2],[14,3,15,11],[14,12,14,13],[14,17,14,18],[15,12,15,13],[15,17,15,18],[12,0,13,2],[12,3,13,11],[12,12,12,13],[12,17,12,18],[13,12,13,13],[13,17,13,18],[0,20,1,31],[0,32,1,61],[9,3,9,4],[9,10,9,13],[10,0,10,18],[11,0,11,2],[11,3,11,11],[11,12,11,18],[7,1,7,3],[7,4,7,9],[7,10,7,15],[7,17,7,18],[8,1,8,3],[8,4,8,9],[8,10,8,15],[8,16,9,16],[8,17,9,18],[9,0,9,2],[5,1,5,3],[5,4,5,9],[5,10,5,15],[6,1,6,3],[6,4,6,9],[6,10,6,15],[0,0,0,11],[0,12,0,13],[0,14,0,18],[1,0,1,18],[2,16,6,18],[5,0,8,0],[3,3,3,7],[3,8,3,10],[3,11,3,15],[2,0,4,0],[4,11,4,15],[4,1,4,10]]}
["2023年度法政大学大学院（様式２）　※全専攻提出",null,null,null,null,null,null,null,null,null,null,null,"受験番号",null,null,null,null,null,null,null,"＜入力に関する注意事項＞",null,null,null,null,null,null,null,null,null,null,null,"※このExcelファイルにはマクロが使用されています。\n  「マクロを有効にする」もしくは「コンテンツの有効化」ボタン等を押して作成を開始してください。"]
["入学志願票（入学試験面接カード）"]
["志願先","①課程",null,null,null,"②研究科",null,null,null,null,null,"③専攻",null,null,null,null,"写真貼付枠\n（3×4㎝）\n\n３か月以内撮影のもの。スナップ写真不可。写真裏面に志望専攻名と氏名を記入",null,null,null,null,"◆「志願先」欄の入力  ※①〜⑥を順番に全て入力してください。"]
[null,"④入試経路",null,null,null,null,null,null,{"$f":"IFERROR(IF(VLOOKUP(D3&H3&N3&D4,'志願先選択一覧（リスト検索用）'!$P:$Q,2,0)=\"なし\",\"⑤その他選択：なし\",\"⑤その他選択\"),\"⑤その他選択\")","v":"⑤その他選択"},null,null,null,null,null,null,null,null,null,null,null,null,null,"・",{"$f":"IF(X5<>\"\",\"以下が未入力です。\",\"入力OK\")","v":"以下が未入力です。"}]
[null,{"$f":"IFERROR(\n  IF(VLOOKUP(D3&H3&N3&D4,その他入力規則!G:H,2,0)=\"併願可\",\n       \"⑥修士課程と研修生の併願\",\n  IF(OR(VLOOKUP(D3&H3&N3&D4,その他入力規則!G:H,2,0)=\"併願不可\",VLOOKUP(D3&H3&N3&D4,その他入力規則!G:H,2,0)=\"該当なし\"),\n       \"⑥この志願先は修士課程と研修生の併願制度はありません\",\"\")),\n  \"⑥修士課程と研修生の併願\")","v":"⑥修士課程と研修生の併願"},null,null,null,null,null,null,null,null,null,null,null,null,null,null,null,null,null,null,null,null,null,{"$f":"IF(D3=\"\",\"①課程：入力欄右下の「▼」マークをクリックして、受験する課程を選択してください。\",\nIF(AND(D3<>\"\",H3=\"\"),\n     \"②研究科：入力欄右下の「▼」マークをクリックして、受験する研究科を選択してください。\",\nIF(AND(D3<>\"\",H3<>\"\",N3=\"\"),\n     \"③専攻：入力欄右下の「▼」マークをクリックして、受験する専攻を選択してください。\",\nIF(AND(D3<>\"\",H3<>\"\",N3<>\"\",D4=\"\"),\n     \"④入試経路：入力欄右下の「▼」マークをクリックして、受験する入試経路を選択してください。\",\nIF(AND(D3<>\"\",H3<>\"\",N3<>\"\",D4<>\"\",L4=\"\",I4=\"⑤その他選択\"),\n     \"⑤その他選択：入力欄右下の「▼」マークをクリックして、必要事項を選択してください。\",\nIF(AND(D3<>\"\",H3<>\"\",N3<>\"\",D4<>\"\",OR(L4<>\"\",AND(L4=\"\",I4=\"⑤その他選択：なし\")),L5=\"\",B5=\"⑥修士課程と研修生の併願\"),\n     \"⑥修士課程と研修生の併願：入力欄右下の「▼」マークをクリックして、修士課程と研修生との併願有無を選択してください。\",\nIF(AND(D3<>\"\",H3<>\"\",N3<>\"\",D4<>\"\",OR(L4<>\"\",AND(L4=\"\",I4=\"⑤その他選択：なし\")),L5<>\"\",B5=\"⑥修士課程と研修生の併願\"),\n     \"\",\nIF(AND(D3<>\"\",H3<>\"\",N3<>\"\",D4<>\"\",OR(L4<>\"\",AND(L4=\"\",I4=\"⑤その他選択：なし\")),L5=\"\",B5=\"⑥この志願先は修士課程と研修生の併願制度はありません\"),\n     \"\",\n))))))))","v":"①課程：入力欄右下の「▼」マークをクリックして、受験する課程を選択してください。"}]
["氏名",null,null,null,"姓（Family Name）",null,null,null,null,null,"名（First Name）"]
[null,"フリガナ"]
[null,"漢字表記",null,null,null,null,null,null,null,null,null,null,null,null,null,null,"性別",null,null,null,null,"◆「氏名」「性別」「国籍」「生年月日」欄の入力"]
[null,"英語表記",null,null,null,null,null,null,null,null,null,null,null,null,null,null,"国籍",null,null,null,null,null,"・",{"$f":"IF(OR(E7=\"\",K7=\"\"),\"「フリガナ」欄が未入力となっています。姓名の両方とも入力してください。\",\"「フリガナ」：入力OK\")","v":"「フリガナ」欄が未入力となっています。姓名の両方とも入力してください。"}]
["生年月日（西暦）",null,null,null,null,"年",null,"月",null,"日生","2023年4月1日時点、満",null,null,null,{"$f":"IF(OR(D10=\"\",G10=\"\",I10=\"\"),\"\",DATEDIF(DATE(D10,G10,I10),\"2023/4/1\",\"Y\"))","v":""},"才",null,null,null,null,null,null,"・",{"$f":"IF(OR(E8=\"\",K8=\"\"),\"「漢字表記」欄が未入力となっています。姓名の両方とも入力してください。※漢字表記がない国出身の志願者は、自国語で入力してください。\",\"「漢字表記」：入力OK\")","v":"「漢字表記」欄が未入力となっています。姓名の両方とも入力してください。※漢字表記がない国出身の志願者は、自国語で入力してください。"}]
{"$rows_left_out":72}
{"sheet":"「志願先」欄  選択一覧","index":1,"n_rows":234,"n_cols":7,"rows_kept":234,"cut":false,"hidden":false,"merged":[]}
["「志願先」欄  選択一覧"]
["No","①課程","②研究科","③専攻","④入試経路","⑤その他選択","⑥修士課程と研修生の併願"]
[1,"修士課程","人文科学研究科","哲学専攻","一般入試","なし","併願可"]
[2,"修士課程","人文科学研究科","哲学専攻","社会人入試","なし","併願可"]
[3,"修士課程","人文科学研究科","日本文学専攻","一般入試","プログラム選択なし","併願可"]
[4,"修士課程","人文科学研究科","日本文学専攻","一般入試","文芸創作研究プログラム","併願可"]
[5,"修士課程","人文科学研究科","日本文学専攻","一般入試","能楽研究者育成プログラム","併願可"]
[6,"修士課程","人文科学研究科","日本文学専攻","外国人入試","プログラム選択なし","併願可"]
[7,"修士課程","人文科学研究科","日本文学専攻","外国人入試","文芸創作研究プログラム","併願可"]
[8,"修士課程","人文科学研究科","日本文学専攻","外国人入試","能楽研究者育成プログラム","併願可"]
{"$rows_left_out":225}
{"sheet":"志願先選択一覧（リスト検索用）","index":2,"n_rows":234,"n_cols":33,"rows_kept":234,"cut":false,"hidden":true,"merged":[]}
["志願先"]
["No","A_課程","A連番","A検索値","B_研究科","B連番","B検索値","C_専攻","B＋C","B＋C連番","C検索値","D_入試経路","B＋C＋D","B＋C＋D連番","D検索値","A＋B＋C＋D","E_その他の選択",null,null,null,"志願票選択値","課程",{"$f":"'様式2_入学志願票（入学試験面接カード）'!D3","v":0},null,null,null,"https://detail.chiebukuro.yahoo.co.jp/qa/question_detail/q1366987793"]
[{"$f":"'「志願先」欄  選択一覧'!A3","v":1},{"$f":"'「志願先」欄  選択一覧'!B3","v":"修士課程"},{"$f":"COUNTIF($B$3:B3,B3)","v":1},{"$f":"B3&C3","v":"修士課程1"},{"$f":"'「志願先」欄  選択一覧'!C3","v":"人文科学研究科"},{"$f":"COUNTIF($E$3:E3,E3)","v":1},{"$f":"E3&F3","v":"人文科学研究科1"},{"$f":"'「志願先」欄  選択一覧'!D3","v":"哲学専攻"},{"$f":"B3&H3","v":"修士課程哲学専攻"},{"$f":"COUNTIF($I$3:I3,I3)","v":1},{"$f":"B3&H3&J3","v":"修士課程哲学専攻1"},{"$f":"'「志願先」欄  選択一覧'!E3","v":"一般入試"},{"$f":"B3&H3&L3","v":"修士課程哲学専攻一般入試"},{"$f":"COUNTIF($M$3:M3,M3)","v":1},{"$f":"B3&H3&L3&N3","v":"修士課程哲学専攻一般入試1"},{"$f":"B3&E3&H3&L3","v":"修士課程人文科学研究科哲学専攻一般入試"},{"$f":"'「志願先」欄  選択一覧'!F3","v":"なし"},null,null,null,null,"研究科",{"$f":"'様式2_入学志願票（入学試験面接カード）'!H3","v":0}]
[{"$f":"'「志願先」欄  選択一覧'!A4","v":2},{"$f":"'「志願先」欄  選択一覧'!B4","v":"修士課程"},{"$f":"COUNTIF($B$3:B4,B4)","v":2},{"$f":"B4&C4","v":"修士課程2"},{"$f":"'「志願先」欄  選択一覧'!C4","v":"人文科学研究科"},{"$f":"COUNTIF($E$3:E4,E4)","v":2},"人文科学研究科2",{"$f":"'「志願先」欄  選択一覧'!D4","v":"哲学専攻"},{"$f":"B4&H4","v":"修士課程哲学専攻"},{"$f":"COUNTIF($I$3:I4,I4)","v":2},{"$f":"B4&H4&J4","v":"修士課程哲学専攻2"},{"$f":"'「志願先」欄  選択一覧'!E4","v":"社会人入試"},{"$f":"B4&H4&L4","v":"修士課程哲学専攻社会人入試"},{"$f":"COUNTIF($M$3:M4,M4)","v":1},"修士課程哲学専攻社会人入試1",{"$f":"B4&E4&H4&L4","v":"修士課程人文科学研究科哲学専攻社会人入試"},{"$f":"'「志願先」欄  選択一覧'!F4","v":"なし"},null,null,null,null,"専攻",{"$f":"'様式2_入学志願票（入学試験面接カード）'!N3","v":0}]
[{"$f":"'「志願先」欄  選択一覧'!A5","v":3},{"$f":"'「志願先」欄  選択一覧'!B5","v":"修士課程"},{"$f":"COUNTIF($B$3:B5,B5)","v":3},"修士課程3",{"$f":"'「志願先」欄  選択一覧'!C5","v":"人文科学研究科"},{"$f":"COUNTIF($E$3:E5,E5)","v":3},"人文科学研究科3",{"$f":"'「志願先」欄  選択一覧'!D5","v":"日本文学専攻"},"修士課程日本文学専攻",{"$f":"COUNTIF($I$3:I5,I5)","v":1},"修士課程日本文学専攻1",{"$f":"'「志願先」欄  選択一覧'!E5","v":"一般入試"},"修士課程日本文学専攻一般入試",{"$f":"COUNTIF($M$3:M5,M5)","v":1},"修士課程日本文学専攻一般入試1","修士課程人文科学研究科日本文学専攻一般入試",{"$f":"'「志願先」欄  選択一覧'!F5","v":"プログラム選択なし"},null,null,null,null,"入試経路",{"$f":"'様式2_入学志願票（入学試験面接カード）'!D4","v":0}]
[{"$f":"'「志願先」欄  選択一覧'!A6","v":4},{"$f":"'「志願先」欄  選択一覧'!B6","v":"修士課程"},{"$f":"COUNTIF($B$3:B6,B6)","v":4},"修士課程4",{"$f":"'「志願先」欄  選択一覧'!C6","v":"人文科学研究科"},{"$f":"COUNTIF($E$3:E6,E6)","v":4},"人文科学研究科4",{"$f":"'「志願先」欄  選択一覧'!D6","v":"日本文学専攻"},"修士課程日本文学専攻",{"$f":"COUNTIF($I$3:I6,I6)","v":2},"修士課程日本文学専攻2",{"$f":"'「志願先」欄  選択一覧'!E6","v":"一般入試"},"修士課程日本文学専攻一般入試",{"$f":"COUNTIF($M$3:M6,M6)","v":2},"修士課程日本文学専攻一般入試2","修士課程人文科学研究科日本文学専攻一般入試",{"$f":"'「志願先」欄  選択一覧'!F6","v":"文芸創作研究プログラム"},null,null,null,null,{"$f":"'様式2_入学志願票（入学試験面接カード）'!I4","v":"⑤その他選択"},{"$f":"'様式2_入学志願票（入学試験面接カード）'!L4","v":0}]
[{"$f":"'「志願先」欄  選択一覧'!A7","v":5},{"$f":"'「志願先」欄  選択一覧'!B7","v":"修士課程"},{"$f":"COUNTIF($B$3:B7,B7)","v":5},"修士課程5",{"$f":"'「志願先」欄  選択一覧'!C7","v":"人文科学研究科"},{"$f":"COUNTIF($E$3:E7,E7)","v":5},"人文科学研究科5",{"$f":"'「志願先」欄  選択一覧'!D7","v":"日本文学専攻"},"修士課程日本文学専攻",{"$f":"COUNTIF($I$3:I7,I7)","v":3},"修士課程日本文学専攻3",{"$f":"'「志願先」欄  選択一覧'!E7","v":"一般入試"},"修士課程日本文学専攻一般入試",{"$f":"COUNTIF($M$3:M7,M7)","v":3},"修士課程日本文学専攻一般入試3","修士課程人文科学研究科日本文学専攻一般入試",{"$f":"'「志願先」欄  選択一覧'!F7","v":"能楽研究者育成プログラム"},null,null,null,null,{"$f":"'様式2_入学志願票（入学試験面接カード）'!B5","v":"⑥修士課程と研修生の併願"}]
[{"$f":"'「志願先」欄  選択一覧'!A8","v":6},{"$f":"'「志願先」欄  選択一覧'!B8","v":"修士課程"},{"$f":"COUNTIF($B$3:B8,B8)","v":6},"修士課程6",{"$f":"'「志願先」欄  選択一覧'!C8","v":"人文科学研究科"},{"$f":"COUNTIF($E$3:E8,E8)","v":6},"人文科学研究科6",{"$f":"'「志願先」欄  選択一覧'!D8","v":"日本文学専攻"},"修士課程日本文学専攻",{"$f":"COUNTIF($I$3:I8,I8)","v":4},"修士課程日本文学専攻4",{"$f":"'「志願先」欄  選択一覧'!E8","v":"外国人入試"},"修士課程日本文学専攻外国人入試",{"$f":"COUNTIF($M$3:M8,M8)","v":1},"修士課程日本文学専攻外国人入試1","修士課程人文科学研究科日本文学専攻外国人入試",{"$f":"'「志願先」欄  選択一覧'!F8","v":"プログラム選択なし"}]
[{"$f":"'「志願先」欄  選択一覧'!A9","v":7},{"$f":"'「志願先」欄  選択一覧'!B9","v":"修士課程"},{"$f":"COUNTIF($B$3:B9,B9)","v":7},"修士課程7",{"$f":"'「志願先」欄  選択一覧'!C9","v":"人文科学研究科"},{"$f":"COUNTIF($E$3:E9,E9)","v":7},"人文科学研究科7",{"$f":"'「志願先」欄  選択一覧'!D9","v":"日本文学専攻"},"修士課程日本文学専攻",{"$f":"COUNTIF($I$3:I9,I9)","v":5},"修士課程日本文学専攻5",{"$f":"'「志願先」欄  選択一覧'!E9","v":"外国人入試"},"修士課程日本文学専攻外国人入試",{"$f":"COUNTIF($M$3:M9,M9)","v":2},"修士課程日本文学専攻外国人入試2","修士課程人文科学研究科日本文学専攻外国人入試",{"$f":"'「志願先」欄  選択一覧'!F9","v":"文芸創作研究プログラム"},null,null,"ドロップダウンリスト"]
[{"$f":"'「志願先」欄  選択一覧'!A10","v":8},{"$f":"'「志願先」欄  選択一覧'!B10","v":"修士課程"},{"$f":"COUNTIF($B$3:B10,B10)","v":8},"修士課程8",{"$f":"'「志願先」欄  選択一覧'!C10","v":"人文科学研究科"},{"$f":"COUNTIF($E$3:E10,E10)","v":8},"人文科学研究科8",{"$f":"'「志願先」欄  選択一覧'!D10","v":"日本文学専攻"},"修士課程日本文学専攻",{"$f":"COUNTIF($I$3:I10,I10)","v":6},"修士課程日本文学専攻6",{"$f":"'「志願先」欄  選択一覧'!E10","v":"外国人入試"},"修士課程日本文学専攻外国人入試",{"$f":"COUNTIF($M$3:M10,M10)","v":3},"修士課程日本文学専攻外国人入試3","修士課程人文科学研究科日本文学専攻外国人入試",{"$f":"'「志願先」欄  選択一覧'!F10","v":"能楽研究者育成プログラム"},null,null,"連番","B2_研究科","B重複チェック","B2重複除く一覧","C2_専攻","C2重複チェック","C2重複を除く一覧","D2_入試経路","D2重複チェック","D2重複を除く一覧","E2_その他の選択","E2重複チェック","E2重複を除く一覧","併願"]
{"$rows_left_out":225}
{"sheet":"科目選択","index":3,"n_rows":410,"n_cols":24,"rows_kept":410,"cut":false,"hidden":true,"merged":[]}
[]
[null,"A_課程","B_研究科","C_専攻","D_入試経路","E_その他の選択","A＋B＋C＋D","A＋B＋C＋D 連番","A＋B＋C＋D 検索値","専門科目","外国語",null,null,null,null,null,null,"志願票選択値",{"$f":"'様式2_入学志願票（入学試験面接カード）'!D3&'様式2_入学志願票（入学試験面接カード）'!H3&'様式2_入学志願票（入学試験面接カード）'!N3&'様式2_入学志願票（入学試験面接カード）'!D4","v":""}]
[null,{"$f":"'「志願先」欄  選択一覧'!B3","v":"修士課程"},{"$f":"'「志願先」欄  選択一覧'!C3","v":"人文科学研究科"},{"$f":"'「志願先」欄  選択一覧'!D3","v":"哲学専攻"},{"$f":"'「志願先」欄  選択一覧'!E3","v":"一般入試"},"―",{"$f":"B3&C3&D3&E3","v":"修士課程人文科学研究科哲学専攻一般入試"},{"$f":"COUNTIF($G$3:G3,G3)","v":1},{"$f":"G3&H3","v":"修士課程人文科学研究科哲学専攻一般入試1"},"専門科目","外国語（言語は当日選択）"]
[null,{"$f":"'「志願先」欄  選択一覧'!B4","v":"修士課程"},{"$f":"'「志願先」欄  選択一覧'!C4","v":"人文科学研究科"},{"$f":"'「志願先」欄  選択一覧'!D4","v":"哲学専攻"},{"$f":"'「志願先」欄  選択一覧'!E4","v":"社会人入試"},{"$f":"'「志願先」欄  選択一覧'!F4","v":"なし"},{"$f":"B4&C4&D4&E4","v":"修士課程人文科学研究科哲学専攻社会人入試"},{"$f":"COUNTIF($G$3:G4,G4)","v":1},{"$f":"G4&H4","v":"修士課程人文科学研究科哲学専攻社会人入試1"},"専門科目","なし",null,null,null,null,null,null,"連番","A専門科目","A重複チェック","A重複除く一覧","B_外国語","B重複チェック","B重複除く一覧"]
[null,{"$f":"'「志願先」欄  選択一覧'!B5","v":"修士課程"},{"$f":"'「志願先」欄  選択一覧'!C5","v":"人文科学研究科"},{"$f":"'「志願先」欄  選択一覧'!D5","v":"日本文学専攻"},{"$f":"'「志願先」欄  選択一覧'!E5","v":"一般入試"},{"$f":"'「志願先」欄  選択一覧'!F5","v":"プログラム選択なし"},"修士課程人文科学研究科日本文学専攻一般入試",{"$f":"COUNTIF($G$3:G5,G5)","v":1},"修士課程人文科学研究科日本文学専攻一般入試1","専門科目","英語"]
[null,{"$f":"'「志願先」欄  選択一覧'!B6","v":"修士課程"},{"$f":"'「志願先」欄  選択一覧'!C6","v":"人文科学研究科"},{"$f":"'「志願先」欄  選択一覧'!D6","v":"日本文学専攻"},{"$f":"'「志願先」欄  選択一覧'!E6","v":"一般入試"},{"$f":"'「志願先」欄  選択一覧'!F6","v":"文芸創作研究プログラム"},"修士課程人文科学研究科日本文学専攻一般入試",{"$f":"COUNTIF($G$3:G6,G6)","v":2},"修士課程人文科学研究科日本文学専攻一般入試2","専門科目","英語",null,null,null,null,null,null,1,{"$f":"VLOOKUP($S$2&R6,$I:$K,2,0)","v":{"$error":"#N/A"}},{"$f":"IF(COUNTIF($S$6:S6,S6)=1,T5+1,T5)","v":1},{"$f":"IFERROR(INDEX($S$6:$S$75,MATCH(ROW(U6)-5,$T$6:$T$75,0)),\"\")","v":""},{"$f":"VLOOKUP($S$2&R6,$I:$K,3,0)","v":{"$error":"#N/A"}},{"$f":"IF(COUNTIF($V$6:V6,V6)=1,W5+1,W5)","v":1},{"$f":"IFERROR(INDEX($V$6:$V$75,MATCH(ROW(X6)-5,$W$6:$W$75,0)),\"\")","v":""}]
[null,{"$f":"'「志願先」欄  選択一覧'!B7","v":"修士課程"},{"$f":"'「志願先」欄  選択一覧'!C7","v":"人文科学研究科"},{"$f":"'「志願先」欄  選択一覧'!D7","v":"日本文学専攻"},{"$f":"'「志願先」欄  選択一覧'!E7","v":"一般入試"},{"$f":"'「志願先」欄  選択一覧'!F7","v":"能楽研究者育成プログラム"},"修士課程人文科学研究科日本文学専攻一般入試",{"$f":"COUNTIF($G$3:G7,G7)","v":3},"修士課程人文科学研究科日本文学専攻一般入試3","専門科目","英語",null,null,null,null,null,null,2,{"$error":"#N/A"},{"$f":"IF(COUNTIF($S$6:S7,S7)=1,T6+1,T6)","v":1},{"$f":"IFERROR(INDEX($S$6:$S$75,MATCH(ROW(U7)-5,$T$6:$T$75,0)),\"\")","v":""},{"$error":"#N/A"},{"$f":"IF(COUNTIF($V$6:V7,V7)=1,W6+1,W6)","v":1},{"$f":"IFERROR(INDEX($V$6:$V$75,MATCH(ROW(X7)-5,$W$6:$W$75,0)),\"\")","v":""}]
[null,{"$f":"'「志願先」欄  選択一覧'!B8","v":"修士課程"},{"$f":"'「志願先」欄  選択一覧'!C8","v":"人文科学研究科"},{"$f":"'「志願先」欄  選択一覧'!D8","v":"日本文学専攻"},{"$f":"'「志願先」欄  選択一覧'!E8","v":"外国人入試"},{"$f":"'「志願先」欄  選択一覧'!F8","v":"プログラム選択なし"},"修士課程人文科学研究科日本文学専攻外国人入試",{"$f":"COUNTIF($G$3:G8,G8)","v":1},"修士課程人文科学研究科日本文学専攻外国人入試1","専門科目","日本語",null,null,null,null,null,null,3,{"$error":"#N/A"},{"$f":"IF(COUNTIF($S$6:S8,S8)=1,T7+1,T7)","v":1},"",{"$error":"#N/A"},{"$f":"IF(COUNTIF($V$6:V8,V8)=1,W7+1,W7)","v":1},""]
[null,{"$f":"'「志願先」欄  選択一覧'!B9","v":"修士課程"},{"$f":"'「志願先」欄  選択一覧'!C9","v":"人文科学研究科"},{"$f":"'「志願先」欄  選択一覧'!D9","v":"日本文学専攻"},{"$f":"'「志願先」欄  選択一覧'!E9","v":"外国人入試"},{"$f":"'「志願先」欄  選択一覧'!F9","v":"文芸創作研究プログラム"},"修士課程人文科学研究科日本文学専攻外国人入試",{"$f":"COUNTIF($G$3:G9,G9)","v":2},"修士課程人文科学研究科日本文学専攻外国人入試2","専門科目","日本語",null,null,null,null,null,null,4,{"$error":"#N/A"},{"$f":"IF(COUNTIF($S$6:S9,S9)=1,T8+1,T8)","v":1},"",{"$error":"#N/A"},{"$f":"IF(COUNTIF($V$6:V9,V9)=1,W8+1,W8)","v":1},""]
[null,{"$f":"'「志願先」欄  選択一覧'!B10","v":"修士課程"},{"$f":"'「志願先」欄  選択一覧'!C10","v":"人文科学研究科"},{"$f":"'「志願先」欄  選択一覧'!D10","v":"日本文学専攻"},{"$f":"'「志願先」欄  選択一覧'!E10","v":"外国人入試"},{"$f":"'「志願先」欄  選択一覧'!F10","v":"能楽研究者育成プログラム"},"修士課程人文科学研究科日本文学専攻外国人入試",{"$f":"COUNTIF($G$3:G10,G10)","v":3},"修士課程人文科学研究科日本文学専攻外国人入試3","専門科目","日本語",null,null,null,null,null,null,5,{"$error":"#N/A"},{"$f":"IF(COUNTIF($S$6:S10,S10)=1,T9+1,T9)","v":1},"",{"$error":"#N/A"},{"$f":"IF(COUNTIF($V$6:V10,V10)=1,W9+1,W9)","v":1},""]
{"$rows_left_out":401}
{"sheet":"その他入力規則","index":4,"n_rows":234,"n_cols":15,"rows_kept":234,"cut":false,"hidden":true,"merged":[]}
[]
[null,"A_課程","B_研究科","C_専攻","D_入試経路","E_その他の選択","A＋B＋C＋D","F_研修生との併願",null,null,null,null,"F_研修生との併願"]
[null,{"$f":"'「志願先」欄  選択一覧'!B3","v":"修士課程"},{"$f":"'「志願先」欄  選択一覧'!C3","v":"人文科学研究科"},{"$f":"'「志願先」欄  選択一覧'!D3","v":"哲学専攻"},{"$f":"'「志願先」欄  選択一覧'!E3","v":"一般入試"},{"$f":"'「志願先」欄  選択一覧'!F3","v":"なし"},{"$f":"B3&C3&D3&E3","v":"修士課程人文科学研究科哲学専攻一般入試"},{"$f":"'「志願先」欄  選択一覧'!G3","v":"併願可"},null,null,null,null,"併願可","併願不可","該当なし"]
[null,{"$f":"'「志願先」欄  選択一覧'!B4","v":"修士課程"},{"$f":"'「志願先」欄  選択一覧'!C4","v":"人文科学研究科"},{"$f":"'「志願先」欄  選択一覧'!D4","v":"哲学専攻"},{"$f":"'「志願先」欄  選択一覧'!E4","v":"社会人入試"},{"$f":"'「志願先」欄  選択一覧'!F4","v":"なし"},{"$f":"B4&C4&D4&E4","v":"修士課程人文科学研究科哲学専攻社会人入試"},{"$f":"'「志願先」欄  選択一覧'!G4","v":"併願可"},null,null,null,null,"併願を希望する"]
[null,{"$f":"'「志願先」欄  選択一覧'!B5","v":"修士課程"},{"$f":"'「志願先」欄  選択一覧'!C5","v":"人文科学研究科"},{"$f":"'「志願先」欄  選択一覧'!D5","v":"日本文学専攻"},{"$f":"'「志願先」欄  選択一覧'!E5","v":"一般入試"},{"$f":"'「志願先」欄  選択一覧'!F5","v":"プログラム選択なし"},"修士課程人文科学研究科日本文学専攻一般入試",{"$f":"'「志願先」欄  選択一覧'!G5","v":"併願可"},null,null,null,null,"併願を希望しない"]
[null,{"$f":"'「志願先」欄  選択一覧'!B6","v":"修士課程"},{"$f":"'「志願先」欄  選択一覧'!C6","v":"人文科学研究科"},{"$f":"'「志願先」欄  選択一覧'!D6","v":"日本文学専攻"},{"$f":"'「志願先」欄  選択一覧'!E6","v":"一般入試"},{"$f":"'「志願先」欄  選択一覧'!F6","v":"文芸創作研究プログラム"},"修士課程人文科学研究科日本文学専攻一般入試",{"$f":"'「志願先」欄  選択一覧'!G6","v":"併願可"}]
[null,{"$f":"'「志願先」欄  選択一覧'!B7","v":"修士課程"},{"$f":"'「志願先」欄  選択一覧'!C7","v":"人文科学研究科"},{"$f":"'「志願先」欄  選択一覧'!D7","v":"日本文学専攻"},{"$f":"'「志願先」欄  選択一覧'!E7","v":"一般入試"},{"$f":"'「志願先」欄  選択一覧'!F7","v":"能楽研究者育成プログラム"},"修士課程人文科学研究科日本文学専攻一般入試",{"$f":"'「志願先」欄  選択一覧'!G7","v":"併願可"}]
[null,{"$f":"'「志願先」欄  選択一覧'!B8","v":"修士課程"},{"$f":"'「志願先」欄  選択一覧'!C8","v":"人文科学研究科"},{"$f":"'「志願先」欄  選択一覧'!D8","v":"日本文学専攻"},{"$f":"'「志願先」欄  選択一覧'!E8","v":"外国人入試"},{"$f":"'「志願先」欄  選択一覧'!F8","v":"プログラム選択なし"},"修士課程人文科学研究科日本文学専攻外国人入試",{"$f":"'「志願先」欄  選択一覧'!G8","v":"併願可"}]
[null,{"$f":"'「志願先」欄  選択一覧'!B9","v":"修士課程"},{"$f":"'「志願先」欄  選択一覧'!C9","v":"人文科学研究科"},{"$f":"'「志願先」欄  選択一覧'!D9","v":"日本文学専攻"},{"$f":"'「志願先」欄  選択一覧'!E9","v":"外国人入試"},{"$f":"'「志願先」欄  選択一覧'!F9","v":"文芸創作研究プログラム"},"修士課程人文科学研究科日本文学専攻外国人入試",{"$f":"'「志願先」欄  選択一覧'!G9","v":"併願可"}]
[null,{"$f":"'「志願先」欄  選択一覧'!B10","v":"修士課程"},{"$f":"'「志願先」欄  選択一覧'!C10","v":"人文科学研究科"},{"$f":"'「志願先」欄  選択一覧'!D10","v":"日本文学専攻"},{"$f":"'「志願先」欄  選択一覧'!E10","v":"外国人入試"},{"$f":"'「志願先」欄  選択一覧'!F10","v":"能楽研究者育成プログラム"},"修士課程人文科学研究科日本文学専攻外国人入試",{"$f":"'「志願先」欄  選択一覧'!G10","v":"併願可"}]
{"$rows_left_out":224}